Python3安装uwsgi报错的解决

2023-10-16 303点热度 0人点赞 0条评论

Python3在安装uwsgi报如下错误:

ERROR: Command errored out with exit status 1:
     command: /opt/backup-upload/venv/bin/python3 -u -c 'import io, os, sys, setuptools, tokenize; sys.argv[0] = '"'"'/tmp/pip-install-qdaw3l4x/uwsgi_5ef385b9b3984a85844d0c233240ec90/setup.py'"'"'; __file__='"'"'/tmp/pip-install-qdaw3l4x/uwsgi_5ef385b9b3984a85844d0c233240ec90/setup.py'"'"';f = getattr(tokenize, '"'"'open'"'"', open)(__file__) if os.path.exists(__file__) else io.StringIO('"'"'from setuptools import setup; setup()'"'"');code = f.read().replace('"'"'\r\n'"'"', '"'"'\n'"'"');f.close();exec(compile(code, __file__, '"'"'exec'"'"'))' install --record /tmp/pip-record-o7jpldyb/install-record.txt --single-version-externally-managed --compile --install-headers /opt/backup-upload/venv/include/site/python3.6/uwsgi
         cwd: /tmp/pip-install-qdaw3l4x/uwsgi_5ef385b9b3984a85844d0c233240ec90/
    Complete output (130 lines):
    /usr/lib64/python3.6/distutils/dist.py:261: UserWarning: Unknown distribution option: 'descriptions'
      warnings.warn(msg)
    running install
    /opt/backup-upload/venv/lib/python3.6/site-packages/setuptools/command/install.py:37: SetuptoolsDeprecationWarning: setup.py install is deprecated. Use build and pip and other standards-based tools.
      setuptools.SetuptoolsDeprecationWarning,
    using profile: buildconf/default.ini
    detected include path: ['/usr/lib/gcc/x86_64-redhat-linux/4.8.5/include', '/usr/local/include', '/usr/include']
    Patching "bin_name" to properly install_scripts dir
    detected CPU cores: 8
    configured CFLAGS: -O2 -I. -Wall -D_LARGEFILE_SOURCE -D_FILE_OFFSET_BITS=64 -Wextra -Wno-unused-parameter -Wno-missing-field-initializers -Wno-format -Wno-format-security -DUWSGI_HAS_IFADDRS -DUWSGI_LOCK_USE_MUTEX -DUWSGI_EVENT_USE_EPOLL -DUWSGI_EVENT_TIMER_USE_TIMERFD -DUWSGI_EVENT_FILEMONITOR_USE_INOTIFY -DUWSGI_VERSION="\"2.0.22\"" -DUWSGI_VERSION_BASE="2" -DUWSGI_VERSION_MAJOR="0" -DUWSGI_VERSION_MINOR="22" -DUWSGI_VERSION_REVISION="0" -DUWSGI_VERSION_CUSTOM="\"\"" -DUWSGI_YAML -DUWSGI_PLUGIN_DIR="\".\"" -DUWSGI_DECLARE_EMBEDDED_PLUGINS="UDEP(python);UDEP(gevent);UDEP(ping);UDEP(cache);UDEP(nagios);UDEP(rrdtool);UDEP(carbon);UDEP(rpc);UDEP(corerouter);UDEP(fastrouter);UDEP(http);UDEP(ugreen);UDEP(signal);UDEP(syslog);UDEP(rsyslog);UDEP(logsocket);UDEP(router_uwsgi);UDEP(router_redirect);UDEP(router_basicauth);UDEP(zergpool);UDEP(redislog);UDEP(mongodblog);UDEP(router_rewrite);UDEP(router_http);UDEP(logfile);UDEP(router_cache);UDEP(rawrouter);UDEP(router_static);UDEP(sslrouter);UDEP(spooler);UDEP(cheaper_busyness);UDEP(symcall);UDEP(transformation_tofile);UDEP(transformation_gzip);UDEP(transformation_chunked);UDEP(transformation_offload);UDEP(router_memcached);UDEP(router_redis);UDEP(router_hash);UDEP(router_expires);UDEP(router_metrics);UDEP(transformation_template);UDEP(stats_pusher_socket);" -DUWSGI_LOAD_EMBEDDED_PLUGINS="ULEP(python);ULEP(gevent);ULEP(ping);ULEP(cache);ULEP(nagios);ULEP(rrdtool);ULEP(carbon);ULEP(rpc);ULEP(corerouter);ULEP(fastrouter);ULEP(http);ULEP(ugreen);ULEP(signal);ULEP(syslog);ULEP(rsyslog);ULEP(logsocket);ULEP(router_uwsgi);ULEP(router_redirect);ULEP(router_basicauth);ULEP(zergpool);ULEP(redislog);ULEP(mongodblog);ULEP(router_rewrite);ULEP(router_http);ULEP(logfile);ULEP(router_cache);ULEP(rawrouter);ULEP(router_static);ULEP(sslrouter);ULEP(spooler);ULEP(cheaper_busyness);ULEP(symcall);ULEP(transformation_tofile);ULEP(transformation_gzip);ULEP(transformation_chunked);ULEP(transformation_offload);ULEP(router_memcached);ULEP(router_redis);ULEP(router_hash);ULEP(router_expires);ULEP(router_metrics);ULEP(transformation_template);ULEP(stats_pusher_socket);"
    *** uWSGI compiling server core ***
    core/utils.o is up to date
    core/protocol.o is up to date
    core/socket.o is up to date
    core/logging.o is up to date
    core/master.o is up to date
    core/master_utils.o is up to date
    core/emperor.o is up to date
    core/notify.o is up to date
    core/mule.o is up to date
    core/subscription.o is up to date
    core/stats.o is up to date
    core/sendfile.o is up to date
    core/async.o is up to date
    core/master_checks.o is up to date
    core/fifo.o is up to date
    core/offload.o is up to date
    core/io.o is up to date
    core/static.o is up to date
    core/websockets.o is up to date
    core/spooler.o is up to date
    core/snmp.o is up to date
    core/exceptions.o is up to date
    core/config.o is up to date
    core/setup_utils.o is up to date
    core/clock.o is up to date
    core/init.o is up to date
    core/buffer.o is up to date
    core/reader.o is up to date
    core/writer.o is up to date
    core/alarm.o is up to date
    core/cron.o is up to date
    core/hooks.o is up to date
    core/plugins.o is up to date
    core/lock.o is up to date
    core/cache.o is up to date
    core/daemons.o is up to date
    core/errors.o is up to date
    core/hash.o is up to date
    core/master_events.o is up to date
    core/chunked.o is up to date
    core/queue.o is up to date
    core/event.o is up to date
    core/signal.o is up to date
    core/strings.o is up to date
    core/progress.o is up to date
    core/timebomb.o is up to date
    core/ini.o is up to date
    core/fsmon.o is up to date
    core/mount.o is up to date
    core/metrics.o is up to date
    core/plugins_builder.o is up to date
    core/sharedarea.o is up to date
    core/rpc.o is up to date
    core/gateway.o is up to date
    core/loop.o is up to date
    core/cookie.o is up to date
    core/querystring.o is up to date
    core/rb_timers.o is up to date
    core/transformations.o is up to date
    core/uwsgi.o is up to date
    proto/base.o is up to date
    proto/uwsgi.o is up to date
    proto/http.o is up to date
    proto/fastcgi.o is up to date
    proto/scgi.o is up to date
    proto/puwsgi.o is up to date
    lib/linux_ns.o is up to date
    core/yaml.o is up to date
    [thread 3][gcc -pthread] core/dot_h.o
    [thread 2][gcc -pthread] core/config_py.o
    *** uWSGI compiling embedded plugins ***
    [thread 5][gcc -pthread] plugins/python/python_plugin.o
    [thread 4][gcc -pthread] plugins/python/pyutils.o
    [thread 6][gcc -pthread] plugins/python/pyloader.o
    [thread 7][gcc -pthread] plugins/python/wsgi_handlers.o
    [thread 0][gcc -pthread] plugins/python/wsgi_headers.o
    [thread 1][gcc -pthread] plugins/python/wsgi_subhandler.o
    [thread 2][gcc -pthread] plugins/python/web3_subhandler.o
    [thread 3][gcc -pthread] plugins/python/pump_subhandler.o
    In file included from plugins/python/python_plugin.c:1:0:
    plugins/python/uwsgi_python.h:4:20: fatal error: Python.h: No such file or directory
     #include <Python.h>
                        ^
    compilation terminated.
    In file included from plugins/python/pyloader.c:1:0:
    plugins/python/uwsgi_python.h:4:20: fatal error: Python.h: No such file or directory
     #include <Python.h>
                        ^
    compilation terminated.
    In file included from plugins/python/wsgi_handlers.c:1:0:
    plugins/python/uwsgi_python.h:4:20: fatal error: Python.h: No such file or directory
     #include <Python.h>
                        ^
    compilation terminated.
    In file included from plugins/python/pyutils.c:1:0:
    plugins/python/uwsgi_python.h:4:20: fatal error: Python.h: No such file or directory
     #include <Python.h>
                        ^
    compilation terminated.
    In file included from plugins/python/wsgi_subhandler.c:1:0:
    plugins/python/uwsgi_python.h:4:20: fatal error: Python.h: No such file or directory
     #include <Python.h>
                        ^
    compilation terminated.
    In file included from plugins/python/wsgi_headers.c:1:0:
    plugins/python/uwsgi_python.h:4:20: fatal error: Python.h: No such file or directory
     #include <Python.h>
                        ^
    compilation terminated.
    In file included from plugins/python/web3_subhandler.c:1:0:
    plugins/python/uwsgi_python.h:4:20: fatal error: Python.h: No such file or directory
     #include <Python.h>
                        ^
    compilation terminated.
    In file included from plugins/python/pump_subhandler.c:1:0:
    plugins/python/uwsgi_python.h:4:20: fatal error: Python.h: No such file or directory
     #include <Python.h>
                        ^
    compilation terminated.
    ----------------------------------------
ERROR: Command errored out with exit status 1: /opt/backup-upload/venv/bin/python3 -u -c 'import io, os, sys, setuptools, tokenize; sys.argv[0] = '"'"'/tmp/pip-install-qdaw3l4x/uwsgi_5ef385b9b3984a85844d0c233240ec90/setup.py'"'"'; __file__='"'"'/tmp/pip-install-qdaw3l4x/uwsgi_5ef385b9b3984a85844d0c233240ec90/setup.py'"'"';f = getattr(tokenize, '"'"'open'"'"', open)(__file__) if os.path.exists(__file__) else io.StringIO('"'"'from setuptools import setup; setup()'"'"');code = f.read().replace('"'"'\r\n'"'"', '"'"'\n'"'"');f.close();exec(compile(code, __file__, '"'"'exec'"'"'))' install --record /tmp/pip-record-o7jpldyb/install-record.txt --single-version-externally-managed --compile --install-headers /opt/backup-upload/venv/include/site/python3.6/uwsgi Check the logs for full command output.

解决办法:

确保安装了Python开发包。可以使用以下命令来安装Python开发包(适用于Debian/Ubuntu系统):

sudo apt-get install python3-dev

如果使用的是Red Hat/CentOS系统,可以使用以下命令来安装Python开发包:

sudo yum install python3-devel

 

admin

这个人很懒,什么都没留下

文章评论

您需要 登录 之后才可以评论